{"text_format":"1","workbook":"xlsx","n_sheets":5,"sheets":["Y7 Roll-Over Funds Request","Y8 New Activities 100k Request","Salary Worksheet","Subaward Worksheet","Projected Ship Rates"],"not_rendered":{"charts":0,"images":15,"macros":1,"external_links":1,"defined_names":37,"comments":3,"pivot_tables":0},"unopened":[],"bounds":{"document_bytes":16777216,"sheet_cells":100000,"rows_first":2000,"rows_last":500,"rows_between":2000,"halvings":0,"cell_chars":16384,"cell_head_chars":4096},"cells_cut":0,"cells_raw":0,"read":"whole","date_system":"1904"}

{"sheet":"Y7 Roll-Over Funds Request","index":0,"n_rows":129,"n_cols":13,"rows_kept":129,"cut":false,"hidden":false,"merged":[[120,0,120,1],[123,0,123,1],[126,0,126,2],[87,0,87,1],[110,0,110,1],[111,0,111,1],[112,0,112,1],[116,0,116,1],[117,0,117,1],[86,0,86,1],[42,0,42,1],[53,0,53,1],[54,0,54,1],[59,0,59,1],[60,0,60,1],[65,0,65,1],[66,0,66,1],[77,0,77,1],[78,0,78,1],[81,0,81,1],[82,0,82,1],[41,0,41,1],[2,0,2,1],[2,2,2,3],[2,4,2,5],[2,6,2,7],[8,0,8,1],[21,0,21,1],[32,0,32,1],[33,0,33,1],[40,0,40,1],[2,8,2,9],[2,10,2,11],[0,0,0,4],[1,2,1,3],[1,4,1,5],[1,6,1,7],[1,8,1,9],[1,10,1,11]]}
["Hobson UAK DHS Y7 Carry-forward/Roll Over Request"]
[]
["TOTAL",null,{"$f":"D129","v":156355.36981},null,{"$f":"F129","v":0},null,{"$f":"H129","v":0},null,{"$f":"J129","v":0},null,{"$f":"L129","v":0},null,{"$f":"M129","v":156355.36981}]
["SALARY/WAGES",null,1,"Y1",{"$f":"IF($C$4=1, \"HOURS\", \"MONTHS\")","v":"HOURS"},"Y2",{"$f":"IF($C$4=1, \"HOURS\", \"MONTHS\")","v":"HOURS"},"Y3",{"$f":"IF($C$4=1, \"HOURS\", \"MONTHS\")","v":"HOURS"},"Y4",{"$f":"IF($C$4=1, \"HOURS\", \"MONTHS\")","v":"HOURS"},"Y5","Total"]
[]
[{"$f":"'Salary Worksheet'!B13","v":"Hobson"},null,231.21,{"$f":"IF($C$4=1,ROUND('Salary Worksheet'!D13*C6,2), ROUND('Salary Worksheet'!D4/12*C6,2))","v":20662.11},0,{"$f":"IF($C$4=1,ROUND('Salary Worksheet'!E13*E6,2), ROUND('Salary Worksheet'!E4/12*E6,2))","v":0},0,{"$f":"IF($C$4=1,ROUND('Salary Worksheet'!F13*G6,2), ROUND('Salary Worksheet'!F4/12*G6,0))","v":0},0,{"$f":"IF($C$4=1,ROUND('Salary Worksheet'!G13*I6,2), ROUND('Salary Worksheet'!G4/12*I6,0))","v":0},0,{"$f":"IF($C$4=1,ROUND('Salary Worksheet'!H13*K6,2), ROUND('Salary Worksheet'!H4/12*K6,0))","v":0},{"$f":"SUM(L6,J6,H6,F6,D6)","v":20662.11}]
[null,null,0,{"$f":"IF($C$4=1,ROUND('Salary Worksheet'!D14*C7,2), ROUND('Salary Worksheet'!D5/12*C7,2))","v":0},0,{"$f":"IF($C$4=1,ROUND('Salary Worksheet'!E14*E7,2), ROUND('Salary Worksheet'!E5/12*E7,2))","v":0},0,{"$f":"IF($C$4=1,ROUND('Salary Worksheet'!F14*G7,2), ROUND('Salary Worksheet'!F5/12*G7,0))","v":0},0,{"$f":"IF($C$4=1,ROUND('Salary Worksheet'!G14*I7,2), ROUND('Salary Worksheet'!G5/12*I7,0))","v":0},0,{"$f":"IF($C$4=1,ROUND('Salary Worksheet'!H14*K7,2), ROUND('Salary Worksheet'!H5/12*K7,0))","v":0},{"$f":"SUM(J7+H7+F7+D7+L7)","v":0}]
[null,null,0,{"$f":"IF($C$4=1,ROUND('Salary Worksheet'!D15*C8,2), ROUND('Salary Worksheet'!D6/12*C8,2))","v":0},0,{"$f":"IF($C$4=1,ROUND('Salary Worksheet'!E15*E8,2), ROUND('Salary Worksheet'!E6/12*E8,2))","v":0},0,{"$f":"IF($C$4=1,ROUND('Salary Worksheet'!F15*G8,2), ROUND('Salary Worksheet'!F6/12*G8,0))","v":0},0,{"$f":"IF($C$4=1,ROUND('Salary Worksheet'!G15*I8,2), ROUND('Salary Worksheet'!G6/12*I8,0))","v":0},0,{"$f":"IF($C$4=1,ROUND('Salary Worksheet'!H15*K8,2), ROUND('Salary Worksheet'!H6/12*K8,0))","v":0},{"$f":"SUM(J8+H8+F8+D8+L8)","v":0}]
["Subtotal Sr. Personnel Salary",null,null,{"$f":"SUM(D6:D8)","v":20662.11},null,{"$f":"SUM(F6:F8)","v":0},null,{"$f":"SUM(H6:H8)","v":0},null,{"$f":"SUM(J6:J8)","v":0},null,{"$f":"SUM(L6:L8)","v":0},{"$f":"SUM(J9+H9+F9+D9+L9)","v":20662.11}]
[{"$f":"'Salary Worksheet'!B16","v":"Kieft"},null,230,{"$f":"IF($C$4=1,ROUND('Salary Worksheet'!D16*C10,2), ROUND('Salary Worksheet'!D7/12*C10,0))","v":20390.91},0,{"$f":"IF($C$4=1,ROUND('Salary Worksheet'!E16*E10,2), ROUND('Salary Worksheet'!E7/12*E10,2))","v":0},0,{"$f":"IF($C$4=1,ROUND('Salary Worksheet'!F16*G10,2), ROUND('Salary Worksheet'!F7/12*G10,2))","v":0},0,{"$f":"IF($C$4=1,ROUND('Salary Worksheet'!G16*I10,2), ROUND('Salary Worksheet'!G7/12*I10,2))","v":0},0,{"$f":"IF($C$4=1,ROUND('Salary Worksheet'!H16*K10,2), ROUND('Salary Worksheet'!H7/12*K10,2))","v":0},{"$f":"SUM(L10+J10+H10+F10+D10)","v":20390.91}]
[{"$f":"'Salary Worksheet'!B17","v":"Raanan"},null,230,{"$f":"IF($C$4=1,ROUND('Salary Worksheet'!D17*C11,2), ROUND('Salary Worksheet'!D4/12*C11,0))","v":14644.32},0,{"$f":"IF($C$4=1,ROUND('Salary Worksheet'!E17*E11,2), ROUND('Salary Worksheet'!E4/12*E11,2))","v":0},0,{"$f":"IF($C$4=1,ROUND('Salary Worksheet'!F17*G11,2), ROUND('Salary Worksheet'!F4/12*G11,2))","v":0},0,{"$f":"IF($C$4=1,ROUND('Salary Worksheet'!G17*I11,2), ROUND('Salary Worksheet'!G4/12*I11,2))","v":0},0,{"$f":"IF($C$4=1,ROUND('Salary Worksheet'!H17*K11,2), ROUND('Salary Worksheet'!H4/12*K11,2))","v":0},14644.32]
[null,null,0,{"$f":"IF($C$4=1,ROUND('Salary Worksheet'!D19*C12,2), ROUND('Salary Worksheet'!D9/12*C12,0))","v":0},0,{"$f":"IF($C$4=1,ROUND('Salary Worksheet'!E19*E12,2), ROUND('Salary Worksheet'!E9/12*E12,2))","v":0},0,{"$f":"IF($C$4=1,ROUND('Salary Worksheet'!F19*G12,2), ROUND('Salary Worksheet'!F9/12*G12,2))","v":0},0,{"$f":"IF($C$4=1,ROUND('Salary Worksheet'!G19*I12,2), ROUND('Salary Worksheet'!G9/12*I12,2))","v":0},0,{"$f":"IF($C$4=1,ROUND('Salary Worksheet'!H19*K12,2), ROUND('Salary Worksheet'!H9/12*K12,2))","v":0},0]
[null,null,0,{"$f":"IF($C$4=1,ROUND('Salary Worksheet'!D22*C13,2), ROUND('Salary Worksheet'!D10/12*C13,0))","v":0},0,{"$f":"IF($C$4=1,ROUND('Salary Worksheet'!E22*E13,2), ROUND('Salary Worksheet'!E10/12*E13,2))","v":0},0,{"$f":"IF($C$4=1,ROUND('Salary Worksheet'!F22*G13,2), ROUND('Salary Worksheet'!F10/12*G13,2))","v":0},0,{"$f":"IF($C$4=1,ROUND('Salary Worksheet'!G22*I13,2), ROUND('Salary Worksheet'!G10/12*I13,2))","v":0},0,{"$f":"IF($C$4=1,ROUND('Salary Worksheet'!H22*K13,2), ROUND('Salary Worksheet'!H10/12*K13,2))","v":0},0]
[null,null,0,{"$f":"IF($C$4=1,ROUND('Salary Worksheet'!D23*C14,2), ROUND('Salary Worksheet'!D11/12*C14,0))","v":0},0,{"$f":"IF($C$4=1,ROUND('Salary Worksheet'!E23*E14,2), ROUND('Salary Worksheet'!E11/12*E14,2))","v":0},0,{"$f":"IF($C$4=1,ROUND('Salary Worksheet'!F23*G14,2), ROUND('Salary Worksheet'!F11/12*G14,2))","v":0},0,{"$f":"IF($C$4=1,ROUND('Salary Worksheet'!G23*I14,2), ROUND('Salary Worksheet'!G11/12*I14,2))","v":0},0,{"$f":"IF($C$4=1,ROUND('Salary Worksheet'!H23*K14,2), ROUND('Salary Worksheet'!H11/12*K14,2))","v":0},0]
[null,null,0,{"$f":"IF($C$4=1,ROUND('Salary Worksheet'!D22*C15,2), ROUND('Salary Worksheet'!D8/12*C15,0))","v":0},0,{"$f":"IF($C$4=1,ROUND('Salary Worksheet'!E22*E15,2), ROUND('Salary Worksheet'!E8/12*E15,2))","v":0},0,{"$f":"IF($C$4=1,ROUND('Salary Worksheet'!F22*G15,2), ROUND('Salary Worksheet'!F8/12*G15,2))","v":0},0,{"$f":"IF($C$4=1,ROUND('Salary Worksheet'!G22*I15,2), ROUND('Salary Worksheet'!G8/12*I15,2))","v":0},0,{"$f":"IF($C$4=1,ROUND('Salary Worksheet'!H22*K15,2), ROUND('Salary Worksheet'!H8/12*K15,2))","v":0},0]
{"$rows_left_out":115}
{"sheet":"Y8 New Activities 100k Request","index":1,"n_rows":129,"n_cols":13,"rows_kept":129,"cut":false,"hidden":false,"merged":[[1,4,1,5],[2,6,2,7],[2,8,2,9],[2,10,2,11],[1,6,1,7],[1,8,1,9],[1,10,1,11],[126,0,126,2],[40,0,40,1],[41,0,41,1],[32,0,32,1],[8,0,8,1],[53,0,53,1],[33,0,33,1],[59,0,59,1],[65,0,65,1],[77,0,77,1],[81,0,81,1],[86,0,86,1],[60,0,60,1],[21,0,21,1],[116,0,116,1],[120,0,120,1],[123,0,123,1],[0,0,0,4],[78,0,78,1],[42,0,42,1],[54,0,54,1],[66,0,66,1],[82,0,82,1],[87,0,87,1],[117,0,117,1],[112,0,112,1],[111,0,111,1],[2,2,2,3],[2,4,2,5],[110,0,110,1],[2,0,2,1],[1,2,1,3]]}
["Hobson UAK DHS Y8 New Activities Request"]
[]
["TOTAL",null,{"$f":"D129","v":100000.23194},null,{"$f":"F129","v":0},null,{"$f":"H129","v":0},null,{"$f":"J129","v":0},null,{"$f":"L129","v":0},null,{"$f":"M129","v":100000.23194}]
["SALARY/WAGES",null,1,"Y1",{"$f":"IF($C$4=1, \"HOURS\", \"MONTHS\")","v":"HOURS"},"Y2",{"$f":"IF($C$4=1, \"HOURS\", \"MONTHS\")","v":"HOURS"},"Y3",{"$f":"IF($C$4=1, \"HOURS\", \"MONTHS\")","v":"HOURS"},"Y4",{"$f":"IF($C$4=1, \"HOURS\", \"MONTHS\")","v":"HOURS"},"Y5","Total"]
[]
[{"$f":"'Salary Worksheet'!B13","v":"Hobson"},null,80,{"$f":"IF($C$4=1,ROUND('Salary Worksheet'!D13*C6,2), ROUND('Salary Worksheet'!D4/12*C6,2))","v":7149.21},0,{"$f":"IF($C$4=1,ROUND('Salary Worksheet'!E13*E6,2), ROUND('Salary Worksheet'!E4/12*E6,2))","v":0},0,{"$f":"IF($C$4=1,ROUND('Salary Worksheet'!F13*G6,2), ROUND('Salary Worksheet'!F4/12*G6,0))","v":0},0,{"$f":"IF($C$4=1,ROUND('Salary Worksheet'!G13*I6,2), ROUND('Salary Worksheet'!G4/12*I6,0))","v":0},0,{"$f":"IF($C$4=1,ROUND('Salary Worksheet'!H13*K6,2), ROUND('Salary Worksheet'!H4/12*K6,0))","v":0},{"$f":"SUM(L6,J6,H6,F6,D6)","v":7149.21}]
[null,null,0,{"$f":"IF($C$4=1,ROUND('Salary Worksheet'!D14*C7,2), ROUND('Salary Worksheet'!D5/12*C7,2))","v":0},0,{"$f":"IF($C$4=1,ROUND('Salary Worksheet'!E14*E7,2), ROUND('Salary Worksheet'!E5/12*E7,2))","v":0},0,{"$f":"IF($C$4=1,ROUND('Salary Worksheet'!F14*G7,2), ROUND('Salary Worksheet'!F5/12*G7,0))","v":0},0,{"$f":"IF($C$4=1,ROUND('Salary Worksheet'!G14*I7,2), ROUND('Salary Worksheet'!G5/12*I7,0))","v":0},0,{"$f":"IF($C$4=1,ROUND('Salary Worksheet'!H14*K7,2), ROUND('Salary Worksheet'!H5/12*K7,0))","v":0},{"$f":"SUM(J7+H7+F7+D7+L7)","v":0}]
[null,null,0,{"$f":"IF($C$4=1,ROUND('Salary Worksheet'!D15*C8,2), ROUND('Salary Worksheet'!D6/12*C8,2))","v":0},0,{"$f":"IF($C$4=1,ROUND('Salary Worksheet'!E15*E8,2), ROUND('Salary Worksheet'!E6/12*E8,2))","v":0},0,{"$f":"IF($C$4=1,ROUND('Salary Worksheet'!F15*G8,2), ROUND('Salary Worksheet'!F6/12*G8,0))","v":0},0,{"$f":"IF($C$4=1,ROUND('Salary Worksheet'!G15*I8,2), ROUND('Salary Worksheet'!G6/12*I8,0))","v":0},0,{"$f":"IF($C$4=1,ROUND('Salary Worksheet'!H15*K8,2), ROUND('Salary Worksheet'!H6/12*K8,0))","v":0},{"$f":"SUM(J8+H8+F8+D8+L8)","v":0}]
["Subtotal Sr. Personnel Salary",null,null,{"$f":"SUM(D6:D8)","v":7149.21},null,{"$f":"SUM(F6:F8)","v":0},null,{"$f":"SUM(H6:H8)","v":0},null,{"$f":"SUM(J6:J8)","v":0},null,{"$f":"SUM(L6:L8)","v":0},{"$f":"SUM(J9+H9+F9+D9+L9)","v":7149.21}]
[{"$f":"'Salary Worksheet'!B16","v":"Kieft"},null,225,{"$f":"IF($C$4=1,ROUND('Salary Worksheet'!D16*C10,2), ROUND('Salary Worksheet'!D7/12*C10,0))","v":19947.63},0,{"$f":"IF($C$4=1,ROUND('Salary Worksheet'!E16*E10,2), ROUND('Salary Worksheet'!E7/12*E10,2))","v":0},0,{"$f":"IF($C$4=1,ROUND('Salary Worksheet'!F16*G10,2), ROUND('Salary Worksheet'!F7/12*G10,2))","v":0},0,{"$f":"IF($C$4=1,ROUND('Salary Worksheet'!G16*I10,2), ROUND('Salary Worksheet'!G7/12*I10,2))","v":0},0,{"$f":"IF($C$4=1,ROUND('Salary Worksheet'!H16*K10,2), ROUND('Salary Worksheet'!H7/12*K10,2))","v":0},{"$f":"SUM(L10+J10+H10+F10+D10)","v":19947.63}]
[{"$f":"'Salary Worksheet'!B17","v":"Raanan"},null,229.78,{"$f":"IF($C$4=1,ROUND('Salary Worksheet'!D17*C11,2), ROUND('Salary Worksheet'!D4/12*C11,0))","v":14630.32},0,{"$f":"IF($C$4=1,ROUND('Salary Worksheet'!E17*E11,2), ROUND('Salary Worksheet'!E4/12*E11,2))","v":0},0,{"$f":"IF($C$4=1,ROUND('Salary Worksheet'!F17*G11,2), ROUND('Salary Worksheet'!F4/12*G11,2))","v":0},0,{"$f":"IF($C$4=1,ROUND('Salary Worksheet'!G17*I11,2), ROUND('Salary Worksheet'!G4/12*I11,2))","v":0},0,{"$f":"IF($C$4=1,ROUND('Salary Worksheet'!H17*K11,2), ROUND('Salary Worksheet'!H4/12*K11,2))","v":0},14630.32]
[null,null,0,{"$f":"IF($C$4=1,ROUND('Salary Worksheet'!D19*C12,2), ROUND('Salary Worksheet'!D9/12*C12,0))","v":0},0,{"$f":"IF($C$4=1,ROUND('Salary Worksheet'!E19*E12,2), ROUND('Salary Worksheet'!E9/12*E12,2))","v":0},0,{"$f":"IF($C$4=1,ROUND('Salary Worksheet'!F19*G12,2), ROUND('Salary Worksheet'!F9/12*G12,2))","v":0},0,{"$f":"IF($C$4=1,ROUND('Salary Worksheet'!G19*I12,2), ROUND('Salary Worksheet'!G9/12*I12,2))","v":0},0,{"$f":"IF($C$4=1,ROUND('Salary Worksheet'!H19*K12,2), ROUND('Salary Worksheet'!H9/12*K12,2))","v":0},0]
[null,null,0,{"$f":"IF($C$4=1,ROUND('Salary Worksheet'!D22*C13,2), ROUND('Salary Worksheet'!D10/12*C13,0))","v":0},0,{"$f":"IF($C$4=1,ROUND('Salary Worksheet'!E22*E13,2), ROUND('Salary Worksheet'!E10/12*E13,2))","v":0},0,{"$f":"IF($C$4=1,ROUND('Salary Worksheet'!F22*G13,2), ROUND('Salary Worksheet'!F10/12*G13,2))","v":0},0,{"$f":"IF($C$4=1,ROUND('Salary Worksheet'!G22*I13,2), ROUND('Salary Worksheet'!G10/12*I13,2))","v":0},0,{"$f":"IF($C$4=1,ROUND('Salary Worksheet'!H22*K13,2), ROUND('Salary Worksheet'!H10/12*K13,2))","v":0},0]
[null,null,0,{"$f":"IF($C$4=1,ROUND('Salary Worksheet'!D23*C14,2), ROUND('Salary Worksheet'!D11/12*C14,0))","v":0},0,{"$f":"IF($C$4=1,ROUND('Salary Worksheet'!E23*E14,2), ROUND('Salary Worksheet'!E11/12*E14,2))","v":0},0,{"$f":"IF($C$4=1,ROUND('Salary Worksheet'!F23*G14,2), ROUND('Salary Worksheet'!F11/12*G14,2))","v":0},0,{"$f":"IF($C$4=1,ROUND('Salary Worksheet'!G23*I14,2), ROUND('Salary Worksheet'!G11/12*I14,2))","v":0},0,{"$f":"IF($C$4=1,ROUND('Salary Worksheet'!H23*K14,2), ROUND('Salary Worksheet'!H11/12*K14,2))","v":0},0]
[null,null,0,{"$f":"IF($C$4=1,ROUND('Salary Worksheet'!D22*C15,2), ROUND('Salary Worksheet'!D8/12*C15,0))","v":0},0,{"$f":"IF($C$4=1,ROUND('Salary Worksheet'!E22*E15,2), ROUND('Salary Worksheet'!E8/12*E15,2))","v":0},0,{"$f":"IF($C$4=1,ROUND('Salary Worksheet'!F22*G15,2), ROUND('Salary Worksheet'!F8/12*G15,2))","v":0},0,{"$f":"IF($C$4=1,ROUND('Salary Worksheet'!G22*I15,2), ROUND('Salary Worksheet'!G8/12*I15,2))","v":0},0,{"$f":"IF($C$4=1,ROUND('Salary Worksheet'!H22*K15,2), ROUND('Salary Worksheet'!H8/12*K15,2))","v":0},0]
{"$rows_left_out":115}
{"sheet":"Salary Worksheet","index":2,"n_rows":54,"n_cols":9,"rows_kept":54,"cut":false,"hidden":false,"merged":[[35,0,35,8],[50,0,50,8],[0,0,0,8],[27,0,27,8],[33,0,33,2],[32,0,32,2],[30,1,30,2],[28,1,28,2],[1,6,1,8]]}
["SALARY WORKSHEET"]
[null,"Salary Increase Rate:",0.03,null,null,null,"CONFIDENTIAL INFORMATION"]
[null,null,"ANNUAL SALARY","YR-1","YR-2","YR-3","YR-4","YR-5"]
[null,"PI/Co-PI1",0,{"$f":"ROUND(C4*($C$2+1),0)","v":0},{"$f":"ROUND(D4*($C$2+1),0)","v":0},{"$f":"ROUND(E4*($C$2+1),0)","v":0},{"$f":"ROUND(F4*($C$2+1),0)","v":0},{"$f":"ROUND(G4*($C$2+1),0)","v":0}]
[null,"PI/Co-PI 2",0,{"$f":"ROUND(C5*($C$2+1),0)","v":0},{"$f":"ROUND(D5*(C2+1),0)","v":0},{"$f":"ROUND(E5*($C$2+1),0)","v":0},0,0]
[null,"PI/Co-PI 3",0,0,{"$f":"ROUND(D6*(C2+1),0)","v":0},0,0,0]
[null,"Other Employee ",0,0,{"$f":"ROUND(D7*(C2+1),0)","v":0},0,0,0]
[null,"Other Employee ",0,0,{"$f":"ROUND(D8*(C2+1),0)","v":0},0,0,0]
[null,"Other Employee ",0,0,{"$f":"ROUND(D9*(C2+1),0)","v":0},0,0,0]
[null,"Other Employee ",0,0,{"$f":"ROUND(D10*(C2+1),0)","v":0},0,0,0]
[null,"Other Employee ",0,0,{"$f":"ROUND(D11*(C2+1),0)","v":0},0,0,0]
[null,null,"HOURLY RATE","YR-1","YR-2","YR-3","YR-4","YR-5"]
[null,"Hobson",{"$f":"84.2352*1.03","v":86.762256000000008},{"$f":"C13*1.03","v":89.365123680000011},{"$f":"ROUND(D13*1.03, 2)","v":92.05},{"$f":"ROUND(E13*1.03, 2)","v":94.81},97.65,100.58]
[null,"PI/Co-PI 2",0,{"$f":"C14*1.03","v":0},{"$f":"ROUND(D14*1.03, 2)","v":0},0,0,0]
[null,"PI/Co-PI 3",0,0,0,0,0,0]
{"$rows_left_out":40}
{"sheet":"Subaward Worksheet","index":3,"n_rows":74,"n_cols":7,"rows_kept":74,"cut":false,"hidden":false,"merged":[[0,0,0,6],[1,0,1,6]]}
["SUBAWARD WORKSHEET"]
["Note: This worksheet calculates subaward overhead and is populated automatically. Enter subaward amounts in the main Budget Worksheet."]
[null,"Y1","Y2","Y3","Y4","Y5","Y1-5"]
[{"$f":"'Y8 New Activities 100k Request'!$A$89","v":0},{"$f":"'Y8 New Activities 100k Request'!$D$89","v":0},{"$f":"'Y8 New Activities 100k Request'!$F$89","v":0},{"$f":"'Y8 New Activities 100k Request'!$H$89","v":0},{"$f":"'Y8 New Activities 100k Request'!$J$89","v":0},{"$f":"'Y8 New Activities 100k Request'!$L$89","v":0},{"$f":"SUM(B4:F4)","v":0}]
["Subject to OH",{"$f":"IF(B4>25000, 25000, B4)","v":0},{"$f":"IF(B4+C4>25000, 25000-B5, C4)","v":0},{"$f":"IF(B4+C4+D4>25000, 25000-(B5+C5), D4)","v":0},{"$f":"IF(B4+C4+D4+E4>25000, 25000-(B5+C5+D5), E4)","v":0},{"$f":"IF(B4+C4+D4+E4+F4>25000, 25000-(B5+C5+D5+E5), F4)","v":0},{"$f":"SUM(B5:F5)","v":0}]
["OH",{"$f":"IF(B4>25000,13125,(B4*0.525))","v":0},{"$f":"IF(C4+B4>25000,13125-B6,ROUND(C4*0.525,0))","v":0},{"$f":"IF(D4+C4+B4>25000,13125-(B6+C6),(D4*0.525))","v":0},{"$f":"IF(E4+D4+C4+B4>25000,13125-(B6+C6+D6),(E4*0.525))","v":0},{"$f":"IF(F4+E4+D4+C4+B4>25000,13125-(B6+C6+D6+E6),(F4*0.525))","v":0},{"$f":"SUM(B6:F6)","v":0}]
[{"$f":"'Y8 New Activities 100k Request'!$A$90","v":0},{"$f":"'Y8 New Activities 100k Request'!$D$90","v":0},{"$f":"'Y8 New Activities 100k Request'!$F$90","v":0},{"$f":"'Y8 New Activities 100k Request'!$H$90","v":0},{"$f":"'Y8 New Activities 100k Request'!$J$91","v":0},{"$f":"'Y8 New Activities 100k Request'!$L$90","v":0},0]
["Subject to OH",{"$f":"IF(B7>25000, 25000, B7)","v":0},{"$f":"IF(B7+C7>25000, 25000-B8, C7)","v":0},{"$f":"IF(B7+C7+D7>25000, 25000-(B8+C8), D7)","v":0},{"$f":"IF(B7+C7+D7+E7>25000, 25000-(B8+C8+D8), E7)","v":0},{"$f":"IF(B7+C7+D7+E7+F7>25000, 25000-(B8+C8+D8+E8), F7)","v":0},{"$f":"SUM(B8:F8)","v":0}]
["OH",{"$f":"IF(B7>25000,13125,(B7*0.525))","v":0},{"$f":"IF(C7+B7>25000,13125-B9,ROUND(C7*0.525,0))","v":0},{"$f":"IF(D7+C7+B7>25000,13125-(B9+C9),(D7*0.525))","v":0},{"$f":"IF(E7+D7+C7+B7>25000,13125-(B9+C9+D9),(E7*0.525))","v":0},{"$f":"IF(F7+E7+D7+C7+B7>25000,13125-(B9+C9+D9+E9),(F7*0.525))","v":0},{"$f":"SUM(B9:F9)","v":0}]
[{"$f":"'Y8 New Activities 100k Request'!$A$91","v":0},{"$f":"'Y8 New Activities 100k Request'!$D$91","v":0},{"$f":"'Y8 New Activities 100k Request'!$F$91","v":0},{"$f":"'Y8 New Activities 100k Request'!$H$91","v":0},{"$f":"'Y8 New Activities 100k Request'!$J$91","v":0},{"$f":"'Y8 New Activities 100k Request'!$L$91","v":0},{"$f":"SUM(B10:F10)","v":0}]
["Subject to OH",{"$f":"IF(B10>25000, 25000, B10)","v":0},{"$f":"IF(B10+C10>25000, 25000-B11, C10)","v":0},{"$f":"IF(B10+C10+D10>25000, 25000-(B11+C11), D10)","v":0},{"$f":"IF(B10+C10+D10+E10>25000, 25000-(B11+C11+D11), E10)","v":0},{"$f":"IF(B10+C10+D10+E10+F10>25000, 25000-(B11+C11+D11+E11), F10)","v":0},{"$f":"SUM(B11:F11)","v":0}]
["OH",{"$f":"IF(B10>25000,13125,(B10*0.525))","v":0},{"$f":"IF(C10+B10>25000,13125-B12,ROUND(C10*0.525,0))","v":0},{"$f":"IF(D10+C10+B10>25000,13125-(B12+C12),(D10*0.525))","v":0},{"$f":"IF(E10+D10+C10+B10>25000,13125-(B12+C12+D12),(E10*0.525))","v":0},{"$f":"IF(F10+E10+D10+C10+B10>25000,13125-(B12+C12+D12+E12),(F10*0.525))","v":0},{"$f":"SUM(B12:F12)","v":0}]
[{"$f":"'Y8 New Activities 100k Request'!$A$92","v":0},{"$f":"'Y8 New Activities 100k Request'!$D$92","v":0},{"$f":"'Y8 New Activities 100k Request'!$F$92","v":0},{"$f":"'Y8 New Activities 100k Request'!$H$92","v":0},{"$f":"'Y8 New Activities 100k Request'!$J$92","v":0},{"$f":"'Y8 New Activities 100k Request'!$L$92","v":0},0]
["Subject to OH",{"$f":"IF(B13>25000, 25000, B13)","v":0},{"$f":"IF(B13+C13>25000, 25000-B14, C13)","v":0},{"$f":"IF(B13+C13+D13>25000, 25000-(B14+C14), D13)","v":0},{"$f":"IF(B13+C13+D13+E13>25000, 25000-(B14+C14+D14), E13)","v":0},{"$f":"IF(B13+C13+D13+E13+F13>25000, 25000-(B14+C14+D14+E14), F13)","v":0},{"$f":"SUM(B14:F14)","v":0}]
["OH",{"$f":"IF(B13>25000,13125,(B13*0.525))","v":0},{"$f":"IF(C13+B13>25000,13125-B15,ROUND(C13*0.525,0))","v":0},{"$f":"IF(D13+C13+B13>25000,13125-(B15+C15),(D13*0.525))","v":0},{"$f":"IF(E13+D13+C13+B13>25000,13125-(B15+C15+D15),(E13*0.525))","v":0},{"$f":"IF(F13+E13+D13+C13+B13>25000,13125-(B15+C15+D15+E15),(F13*0.525))","v":0},{"$f":"SUM(B15:F15)","v":0}]
{"$rows_left_out":60}
{"sheet":"Projected Ship Rates","index":4,"n_rows":13,"n_cols":8,"rows_kept":13,"cut":false,"hidden":false,"merged":[]}
["Asset",2020,2021,2022,2023,2024,2025,2026]
["Rachel Carson",13385,11500,11900,12300,12700,13100]
["Rachel Carson 12",14660,12500,12900,13400,13800,14200]
["Ventana",6400,5000,5200,5400,5600,5800]
["Western Flyer with Ricketts",33000,33990,35009.700000000004,"N/A","N/A","N/A"]
["AUV",12745,13100,13500,13900,14300,14775]
["Paragon",500,515,530,545,560,580]
[]
[]
[]
[]
["Carson w Ventana",{"$f":"B3+B4","v":21060},17500,18100,18800,19400,20000]
[null,null," "]