{"text_format":"1","workbook":"xlsx","n_sheets":4,"sheets":["BudgetWorksheet","Salary Worksheet","Subaward Worksheet","Ship rates"],"not_rendered":{"charts":0,"images":14,"macros":1,"external_links":0,"defined_names":15,"comments":2,"pivot_tables":0},"unopened":[],"bounds":{"document_bytes":16777216,"sheet_cells":100000,"rows_first":2000,"rows_last":500,"rows_between":2000,"halvings":0,"cell_chars":16384,"cell_head_chars":4096},"cells_cut":0,"cells_raw":0,"read":"whole","date_system":"1904"}

{"sheet":"BudgetWorksheet","index":0,"n_rows":113,"n_cols":13,"rows_kept":113,"cut":false,"hidden":false,"merged":[[1,4,1,5],[2,6,2,7],[2,8,2,9],[2,10,2,11],[1,6,1,7],[1,8,1,9],[1,10,1,11],[110,0,110,2],[36,0,36,1],[37,0,37,1],[28,0,28,1],[8,0,8,1],[49,0,49,1],[29,0,29,1],[53,0,53,1],[59,0,59,1],[71,0,71,1],[75,0,75,1],[80,0,80,1],[54,0,54,1],[17,0,17,1],[100,0,100,1],[104,0,104,1],[107,0,107,1],[0,0,0,4],[72,0,72,1],[38,0,38,1],[50,0,50,1],[60,0,60,1],[76,0,76,1],[81,0,81,1],[101,0,101,1],[94,0,94,1],[93,0,93,1],[2,2,2,3],[2,4,2,5],[92,0,92,1],[2,0,2,1],[1,2,1,3]]}
["Hobson DHS UAK budget",null,null,null,null,null,null,null,null,null,null,"Updated:",{"$f":"TODAY()","v":"2017-04-26"}]
[null,null,"DHS Year 3",null,"DHS Year 4"]
["TOTAL",null,{"$f":"D113","v":40000.090400000001},null,{"$f":"F113","v":117697.508},null,{"$f":"H113","v":0},null,{"$f":"J113","v":0},null,{"$f":"L113","v":0},null,{"$f":"M113","v":157697.59840000002}]
["SALARY/WAGES",null,1,"Y1",{"$f":"IF($C$4=1, \"HOURS\", \"MONTHS\")","v":"HOURS"},"Y2",{"$f":"IF($C$4=1, \"HOURS\", \"MONTHS\")","v":"HOURS"},"Y3",{"$f":"IF($C$4=1, \"HOURS\", \"MONTHS\")","v":"HOURS"},"Y4",{"$f":"IF($C$4=1, \"HOURS\", \"MONTHS\")","v":"HOURS"},"Y5","Total"]
[]
[{"$f":"'Salary Worksheet'!B4","v":"Brett Hobson "},null,10,{"$f":"IF($C$4=1,ROUND('Salary Worksheet'!D16*C6,2), ROUND('Salary Worksheet'!D4/12*C6,2))","v":752.47},40,{"$f":"IF($C$4=1,ROUND('Salary Worksheet'!E16*E6,2), ROUND('Salary Worksheet'!E4/12*E6,2))","v":3100},0,{"$f":"IF($C$4=1,ROUND('Salary Worksheet'!F16*G6,2), ROUND('Salary Worksheet'!F4/12*G6,0))","v":0},0,{"$f":"IF($C$4=1,ROUND('Salary Worksheet'!G16*I6,2), ROUND('Salary Worksheet'!G4/12*I6,0))","v":0},0,{"$f":"IF($C$4=1,ROUND('Salary Worksheet'!H16*K6,2), ROUND('Salary Worksheet'!H4/12*K6,0))","v":0},{"$f":"SUM(L6,J6,H6,F6,D6)","v":3852.4700000000003}]
[null,null,0,{"$f":"IF($C$4=1,ROUND('Salary Worksheet'!D17*C7,2), ROUND('Salary Worksheet'!D5/12*C7,2))","v":0},0,{"$f":"IF($C$4=1,ROUND('Salary Worksheet'!E17*E7,2), ROUND('Salary Worksheet'!E5/12*E7,2))","v":0},0,{"$f":"IF($C$4=1,ROUND('Salary Worksheet'!F17*G7,2), ROUND('Salary Worksheet'!F5/12*G7,0))","v":0},0,{"$f":"IF($C$4=1,ROUND('Salary Worksheet'!G17*I7,2), ROUND('Salary Worksheet'!G5/12*I7,0))","v":0},0,{"$f":"IF($C$4=1,ROUND('Salary Worksheet'!H17*K7,2), ROUND('Salary Worksheet'!H5/12*K7,0))","v":0},{"$f":"SUM(J7+H7+F7+D7+L7)","v":0}]
[null,null,0,{"$f":"IF($C$4=1,ROUND('Salary Worksheet'!D18*C8,2), ROUND('Salary Worksheet'!D6/12*C8,2))","v":0},0,{"$f":"IF($C$4=1,ROUND('Salary Worksheet'!E18*E8,2), ROUND('Salary Worksheet'!E6/12*E8,2))","v":0},0,{"$f":"IF($C$4=1,ROUND('Salary Worksheet'!F18*G8,2), ROUND('Salary Worksheet'!F6/12*G8,0))","v":0},0,{"$f":"IF($C$4=1,ROUND('Salary Worksheet'!G18*I8,2), ROUND('Salary Worksheet'!G6/12*I8,0))","v":0},0,{"$f":"IF($C$4=1,ROUND('Salary Worksheet'!H18*K8,2), ROUND('Salary Worksheet'!H6/12*K8,0))","v":0},{"$f":"SUM(J8+H8+F8+D8+L8)","v":0}]
["Subtotal Sr. Personnel Salary",null,null,{"$f":"SUM(D6:D8)","v":752.47},null,{"$f":"SUM(F6:F8)","v":3100},null,{"$f":"SUM(H6:H8)","v":0},null,{"$f":"SUM(J6:J8)","v":0},null,{"$f":"SUM(L6:L8)","v":0},{"$f":"SUM(J9+H9+F9+D9+L9)","v":3852.4700000000003}]
[{"$f":"'Salary Worksheet'!B7","v":"Ben Rannan"},null,54.15,{"$f":"IF($C$4=1,ROUND('Salary Worksheet'!D19*C10,2), ROUND('Salary Worksheet'!D7/12*C10,0))","v":2306.06},90,{"$f":"IF($C$4=1,ROUND('Salary Worksheet'!E19*E10,2), ROUND('Salary Worksheet'!E7/12*E10,2))","v":3947.4},0,{"$f":"IF($C$4=1,ROUND('Salary Worksheet'!F19*G10,2), ROUND('Salary Worksheet'!F7/12*G10,2))","v":0},0,{"$f":"IF($C$4=1,ROUND('Salary Worksheet'!G19*I10,2), ROUND('Salary Worksheet'!G7/12*I10,2))","v":0},0,{"$f":"IF($C$4=1,ROUND('Salary Worksheet'!H19*K10,2), ROUND('Salary Worksheet'!H7/12*K10,2))","v":0},{"$f":"SUM(L10+J10+H10+F10+D10)","v":6253.46}]
[{"$f":"'Salary Worksheet'!B8","v":"Brian Kieft"},null,0,{"$f":"IF($C$4=1,ROUND('Salary Worksheet'!D20*C11,2), ROUND('Salary Worksheet'!D8/12*C11,0))","v":0},100,{"$f":"IF($C$4=1,ROUND('Salary Worksheet'!E20*E11,2), ROUND('Salary Worksheet'!E8/12*E11,2))","v":7726},0,{"$f":"IF($C$4=1,ROUND('Salary Worksheet'!F20*G11,2), ROUND('Salary Worksheet'!F8/12*G11,2))","v":0},0,{"$f":"IF($C$4=1,ROUND('Salary Worksheet'!G20*I11,2), ROUND('Salary Worksheet'!G8/12*I11,2))","v":0},0,{"$f":"IF($C$4=1,ROUND('Salary Worksheet'!H20*K11,2), ROUND('Salary Worksheet'!H8/12*K11,2))","v":0},7726]
[{"$f":"'Salary Worksheet'!B9","v":"Mark Chaffey"},null,70,{"$f":"IF($C$4=1,ROUND('Salary Worksheet'!D21*C12,2), ROUND('Salary Worksheet'!D9/12*C12,0))","v":6066.92},100,{"$f":"IF($C$4=1,ROUND('Salary Worksheet'!E21*E12,2), ROUND('Salary Worksheet'!E9/12*E12,2))","v":8927},0,{"$f":"IF($C$4=1,ROUND('Salary Worksheet'!F21*G12,2), ROUND('Salary Worksheet'!F9/12*G12,2))","v":0},0,{"$f":"IF($C$4=1,ROUND('Salary Worksheet'!G21*I12,2), ROUND('Salary Worksheet'!G9/12*I12,2))","v":0},0,{"$f":"IF($C$4=1,ROUND('Salary Worksheet'!H21*K12,2), ROUND('Salary Worksheet'!H9/12*K12,2))","v":0},14993.92]
[{"$f":"'Salary Worksheet'!B10","v":"Jon Erikson"},null,70,{"$f":"IF($C$4=1,ROUND('Salary Worksheet'!D22*C13,2), ROUND('Salary Worksheet'!D10/12*C13,0))","v":5003.04},65,{"$f":"IF($C$4=1,ROUND('Salary Worksheet'!E22*E13,2), ROUND('Salary Worksheet'!E10/12*E13,2))","v":4785.3},0,{"$f":"IF($C$4=1,ROUND('Salary Worksheet'!F22*G13,2), ROUND('Salary Worksheet'!F10/12*G13,2))","v":0},0,{"$f":"IF($C$4=1,ROUND('Salary Worksheet'!G22*I13,2), ROUND('Salary Worksheet'!G10/12*I13,2))","v":0},0,{"$f":"IF($C$4=1,ROUND('Salary Worksheet'!H22*K13,2), ROUND('Salary Worksheet'!H10/12*K13,2))","v":0},9788.34]
[{"$f":"'Salary Worksheet'!B11","v":"Jim Schofield"},null,0,{"$f":"IF($C$4=1,ROUND('Salary Worksheet'!D23*C14,2), ROUND('Salary Worksheet'!D11/12*C14,0))","v":0},166,{"$f":"IF($C$4=1,ROUND('Salary Worksheet'!E23*E14,2), ROUND('Salary Worksheet'!E11/12*E14,2))","v":8341.5},0,{"$f":"IF($C$4=1,ROUND('Salary Worksheet'!F23*G14,2), ROUND('Salary Worksheet'!F11/12*G14,2))","v":0},0,{"$f":"IF($C$4=1,ROUND('Salary Worksheet'!G23*I14,2), ROUND('Salary Worksheet'!G11/12*I14,2))","v":0},0,{"$f":"IF($C$4=1,ROUND('Salary Worksheet'!H23*K14,2), ROUND('Salary Worksheet'!H11/12*K14,2))","v":0},8341.5]
[{"$f":"'Salary Worksheet'!B12","v":"Paul Coenen"},null,0,{"$f":"IF($C$4=1,ROUND('Salary Worksheet'!D24*C15,2), ROUND('Salary Worksheet'!D12/12*C15,0))","v":0},200,{"$f":"IF($C$4=1,ROUND('Salary Worksheet'!E24*E15,2), ROUND('Salary Worksheet'!E12/12*E15,2))","v":9146},0,{"$f":"IF($C$4=1,ROUND('Salary Worksheet'!F24*G15,2), ROUND('Salary Worksheet'!F12/12*G15,2))","v":0},0,{"$f":"IF($C$4=1,ROUND('Salary Worksheet'!G24*I15,2), ROUND('Salary Worksheet'!G12/12*I15,2))","v":0},0,{"$f":"IF($C$4=1,ROUND('Salary Worksheet'!H24*K15,2), ROUND('Salary Worksheet'!H12/12*K15,2))","v":0},9146]
[{"$f":"'Salary Worksheet'!B13","v":"Jose Rosal"},null,20,{"$f":"IF($C$4=1,ROUND('Salary Worksheet'!D25*C16,2), ROUND('Salary Worksheet'!D13/12*C16,0))","v":1087.21},60,{"$f":"IF($C$4=1,ROUND('Salary Worksheet'!E25*E16,2), ROUND('Salary Worksheet'!E13/12*E16,2))","v":3359.4},0,{"$f":"IF($C$4=1,ROUND('Salary Worksheet'!F25*G16,2), ROUND('Salary Worksheet'!F13/12*G16,2))","v":0},0,{"$f":"IF($C$4=1,ROUND('Salary Worksheet'!G25*I16,2), ROUND('Salary Worksheet'!G13/12*I16,2))","v":0},0,{"$f":"IF($C$4=1,ROUND('Salary Worksheet'!H25*K16,2), ROUND('Salary Worksheet'!H13/12*K16,2))","v":0},4446.6100000000006]
[{"$f":"'Salary Worksheet'!B14","v":"Ray Thompson"},null,30,{"$f":"IF($C$4=1,ROUND('Salary Worksheet'!D26*C17,2), ROUND('Salary Worksheet'!D14/12*C17,0))","v":1550.18},0,{"$f":"IF($C$4=1,ROUND('Salary Worksheet'!E26*E17,2), ROUND('Salary Worksheet'!E14/12*E17,2))","v":0},0,{"$f":"IF($C$4=1,ROUND('Salary Worksheet'!F26*G17,2), ROUND('Salary Worksheet'!F14/12*G17,2))","v":0},0,{"$f":"IF($C$4=1,ROUND('Salary Worksheet'!G26*I17,2), ROUND('Salary Worksheet'!G14/12*I17,2))","v":0},0,{"$f":"IF($C$4=1,ROUND('Salary Worksheet'!H26*K17,2), ROUND('Salary Worksheet'!H14/12*K17,2))","v":0},1550.18]
["Subtotal Other Employee Salary",null,0,{"$f":"SUM(D10:D17)","v":16013.41},0,{"$f":"SUM(F10:F17)","v":46232.6},0,{"$f":"SUM(H10:H17)","v":0},0,{"$f":"SUM(J10:J17)","v":0},0,{"$f":"SUM(L10:L17)","v":0},{"$f":"SUM(J18+H18+F18+D18+L18)","v":62246.009999999995}]
["POSTDOCS, GSRs, PART-TIME, TEMPS",null,0,null,0,null,0,null,0,null,0]
["To calculate labor costs for Postdocs and GSRs, enter months of effort below; salary will calculate automatically based on MBARI rates.",null,0,null,0,null,0,null,0,null,0]
{"$rows_left_out":94}
{"sheet":"Salary Worksheet","index":1,"n_rows":53,"n_cols":9,"rows_kept":53,"cut":false,"hidden":false,"merged":[[34,0,34,8],[49,0,49,8],[0,0,0,8],[26,0,26,8],[32,0,32,2],[31,0,31,2],[29,1,29,2],[27,1,27,2],[1,6,1,8]]}
["SALARY WORKSHEET"]
[null,"Salary Increase Rate:",0.03,null,null,null,"CONFIDENTIAL INFORMATION"]
[null,null,"ANNUAL SALARY","YR-1","YR-2","YR-3","YR-4","YR-5"]
[null,"Brett Hobson ",{"$f":"75.2465*2080","v":156512.72},{"$f":"C4","v":156512.72},{"$f":"ROUND(D4*($C$2+1),0)","v":161208},{"$f":"ROUND(E4*($C$2+1),0)","v":166044},{"$f":"ROUND(F4*($C$2+1),0)","v":171025},{"$f":"ROUND(G4*($C$2+1),0)","v":176156}]
[null,null,0,{"$f":"C5","v":0},{"$f":"ROUND(D5*(C2+1),0)","v":0},{"$f":"ROUND(E5*($C$2+1),0)","v":0},0,0]
[null,null,0,{"$f":"C6","v":0},{"$f":"ROUND(D6*(C2+1),0)","v":0},0,0,0]
[null,"Ben Rannan",{"$f":"42.5865*2080","v":88579.92},88579.92,{"$f":"ROUND(D7*(C2+1),0)","v":91237},93974,96793,99697]
[null,"Brian Kieft",{"$f":"75.011*2080","v":156022.88},156022.88,{"$f":"ROUND(D8*(C2+1),0)","v":160704},165525,170491,175606]
[null,"Mark Chaffey",{"$f":"86.6703*2080","v":180274.22399999999},180274.22399999999,{"$f":"ROUND(D9*(C2+1),0)","v":185682},191252,196990,202900]
[null,"Jon Erikson",{"$f":"71.472*2080","v":148661.75999999998},148661.75999999998,{"$f":"ROUND(D10*(C2+1),0)","v":153122},157716,162447,167320]
[null,"Jim Schofield",{"$f":"48.79*2080","v":101483.2},101483.2,{"$f":"D11*1.03","v":104527.696},107664,110894,114221]
[null,"Paul Coenen",{"$f":"44.4009*2080","v":92353.872000000003},{"$f":"C12","v":92353.872000000003},{"$f":"D12*1.03","v":95124.488160000008},{"$f":"ROUND(E12*($C$2+1),0)","v":97978},{"$f":"ROUND(F12*($C$2+1),0)","v":100917},{"$f":"ROUND(G12*($C$2+1),0)","v":103945}]
[null,"Jose Rosal",{"$f":"54.3607*2080","v":113070.25600000001},{"$f":"C13","v":113070.25600000001},{"$f":"1.03*D13","v":116462.36368000001},{"$f":"ROUND(E13*($C$2+1),0)","v":119956},{"$f":"ROUND(F13*($C$2+1),0)","v":123555},{"$f":"ROUND(G13*($C$2+1),0)","v":127262}]
[null,"Ray Thompson",{"$f":"51.6728*2080","v":107479.424},107479.424,{"$f":"D14*1.03","v":110703.80672000001},114025,117446,120969]
[null,null,"HOURLY RATE","YR-1","YR-2","YR-3","YR-4","YR-5"]
[null,"Brett Hobson ",75.246499999999997,{"$f":"C16","v":75.246499999999997},{"$f":"ROUND(D16*1.03, 2)","v":77.5},{"$f":"ROUND(E16*1.03, 2)","v":79.83},82.22,84.69]
[null,null,0,{"$f":"C17","v":0},{"$f":"ROUND(D17*1.03, 2)","v":0},0,0,0]
[null,null,0,0,0,0,0,0]
[null,"Ben Rannan",42.586500000000001,42.586500000000001,43.86,45.18,46.54,47.94]
[null,"Brian Kieft",75.010999999999996,75.010999999999996,77.260000000000005,79.58,81.97,84.43]
{"$rows_left_out":34}
{"sheet":"Subaward Worksheet","index":2,"n_rows":38,"n_cols":7,"rows_kept":38,"cut":false,"hidden":false,"merged":[[0,0,0,6],[1,0,1,6]]}
["SUBAWARD WORKSHEET"]
["Note: This worksheet calculates subaward overhead and is populated automatically. Enter subaward amounts in the main Budget Worksheet."]
[null,"Y1","Y2","Y3","Y4","Y5","Y1-5"]
[{"$f":"BudgetWorksheet!$A$83","v":"Subaward 1"},{"$f":"BudgetWorksheet!$D$83","v":0},{"$f":"BudgetWorksheet!$F$83","v":0},{"$f":"BudgetWorksheet!$H$83","v":0},{"$f":"BudgetWorksheet!$J$83","v":0},{"$f":"BudgetWorksheet!$L$83","v":0},{"$f":"SUM(B4:F4)","v":0}]
["Subject to OH",{"$f":"IF(B4>25000, 25000, B4)","v":0},{"$f":"IF(B4+C4>25000, 25000-B5, C4)","v":0},{"$f":"IF(B4+C4+D4>25000, 25000-(B5+C5), D4)","v":0},{"$f":"IF(B4+C4+D4+E4>25000, 25000-(B5+C5+D5), E4)","v":0},{"$f":"IF(B4+C4+D4+E4+F4>25000, 25000-(B5+C5+D5+E5), F4)","v":0},{"$f":"SUM(B5:F5)","v":0}]
["OH",{"$f":"IF(B4>25000, 12750, (B4*0.51))","v":0},{"$f":"IF(C4+B4>25000,12750-B6,ROUND(C4*0.51,0))","v":0},{"$f":"IF(D4+C4+B4>25000,12750-(B6+C6),(D4*0.51))","v":0},{"$f":"IF(E4+D4+C4+B4>25000,12750-(B6+C6+D6),(E4*0.51))","v":0},{"$f":"IF(F4+E4+D4+C4+B4>25000,12750-(B6+C6+D6+E6),(F4*0.51))","v":0},0]
[{"$f":"BudgetWorksheet!$A$84","v":"Subaward 2"},{"$f":"BudgetWorksheet!$D$84","v":0},{"$f":"BudgetWorksheet!$F$84","v":0},{"$f":"BudgetWorksheet!$H$84","v":0},{"$f":"BudgetWorksheet!$J$84","v":0},{"$f":"BudgetWorksheet!$L$84","v":0},0]
["Subject to OH",{"$f":"IF(B7>25000, 25000, B7)","v":0},{"$f":"IF(B7+C7>25000, 25000-B8, C7)","v":0},{"$f":"IF(B7+C7+D7>25000, 25000-(B8+C8), D7)","v":0},{"$f":"IF(B7+C7+D7+E7>25000, 25000-(B8+C8+D8), E7)","v":0},{"$f":"IF(B7+C7+D7+E7+F7>25000, 25000-(B8+C8+D8+E8), F7)","v":0},{"$f":"SUM(B8:F8)","v":0}]
["OH",{"$f":"IF(B7>25000, 12750, (B7*0.51))","v":0},{"$f":"IF(C7+B7>25000,12750-B9,ROUND(C7*0.51,0))","v":0},{"$f":"IF(D7+C7+B7>25000,12750-(B9+C9),(D7*0.51))","v":0},{"$f":"IF(E7+D7+C7+B7>25000,12750-(B9+C9+D9),(E7*0.51))","v":0},{"$f":"IF(F7+E7+D7+C7+B7>25000,12750-(B9+C9+D9+E9),(F7*0.51))","v":0},0]
[{"$f":"BudgetWorksheet!$A$85","v":"Subaward 3"},{"$f":"BudgetWorksheet!$D$85","v":0},{"$f":"BudgetWorksheet!$F$85","v":0},{"$f":"BudgetWorksheet!$H$85","v":0},{"$f":"BudgetWorksheet!$J$85","v":0},{"$f":"BudgetWorksheet!$L$85","v":0},0]
["Subject to OH",{"$f":"IF(B10>25000, 25000, B10)","v":0},{"$f":"IF(B10+C10>25000, 25000-B11, C10)","v":0},{"$f":"IF(B10+C10+D10>25000, 25000-(B11+C11), D10)","v":0},{"$f":"IF(B10+C10+D10+E10>25000, 25000-(B11+C11+D11), E10)","v":0},{"$f":"IF(B10+C10+D10+E10+F10>25000, 25000-(B11+C11+D11+E11), F10)","v":0},{"$f":"SUM(B11:F11)","v":0}]
["OH",{"$f":"IF(B10>25000, 12750, (B10*0.51))","v":0},{"$f":"IF(C10+B10>25000,12750-B12,ROUND(C10*0.51,0))","v":0},{"$f":"IF(D10+C10+B10>25000,12750-(B12+C12),(D10*0.51))","v":0},{"$f":"IF(E10+D10+C10+B10>25000,12750-(B12+C12+D12),(E10*0.51))","v":0},{"$f":"IF(F10+E10+D10+C10+B10>25000,12750-(B12+C12+D12+E12),(F10*0.51))","v":0},0]
[{"$f":"BudgetWorksheet!$A$86","v":"Subaward 4"},{"$f":"BudgetWorksheet!$D$86","v":0},{"$f":"BudgetWorksheet!$F$86","v":0},{"$f":"BudgetWorksheet!$H$86","v":0},{"$f":"BudgetWorksheet!$J$86","v":0},{"$f":"BudgetWorksheet!$L$86","v":0},{"$f":"SUM(B13:F13)","v":0}]
["Subject to OH",{"$f":"IF(B13>25000, 25000, B13)","v":0},{"$f":"IF(B13+C13>25000, 25000-B14, C13)","v":0},{"$f":"IF(B13+C13+D13>25000, 25000-(B14+C14), D13)","v":0},{"$f":"IF(B13+C13+D13+E13>25000, 25000-(B14+C14+D14), E13)","v":0},{"$f":"IF(B13+C13+D13+E13+F13>25000, 25000-(B14+C14+D14+E14), F13)","v":0},{"$f":"SUM(B14:F14)","v":0}]
["OH",{"$f":"IF(B13>25000, 12750, (B13*0.51))","v":0},{"$f":"IF(C13+B13>25000,12750-B15,ROUND(C13*0.51,0))","v":0},{"$f":"IF(D13+C13+B13>25000,12750-(B15+C15),(D13*0.51))","v":0},{"$f":"IF(E13+D13+C13+B13>25000,12750-(B15+C15+D15),(E13*0.51))","v":0},{"$f":"IF(F13+E13+D13+C13+B13>25000,12750-(B15+C15+D15+E15),(F13*0.51))","v":0},0]
[{"$f":"BudgetWorksheet!$A$87","v":"Subaward 5"},{"$f":"BudgetWorksheet!$D$87","v":0},{"$f":"BudgetWorksheet!$F$87","v":0},{"$f":"BudgetWorksheet!$H$87","v":0},{"$f":"BudgetWorksheet!$J$87","v":0},{"$f":"BudgetWorksheet!$L$87","v":0},0]
["Subject to OH",{"$f":"IF(B16>25000, 25000, B16)","v":0},{"$f":"IF(B16+C16>25000, 25000-B17, C16)","v":0},{"$f":"IF(B16+C16+D16>25000, 25000-(B17+C17), D16)","v":0},{"$f":"IF(B16+C16+D16+E16>25000, 25000-(B17+C17+D17), E16)","v":0},{"$f":"IF(B16+C16+D16+E16+F16>25000, 25000-(B17+C17+D17+E17), F16)","v":0},{"$f":"SUM(B17:F17)","v":0}]
["OH",{"$f":"IF(B16>25000, 12750, (B16*0.51))","v":0},{"$f":"IF(C16+B16>25000,12750-B18,ROUND(C16*0.51,0))","v":0},{"$f":"IF(D16+C16+B16>25000,12750-(B18+C18),(D16*0.51))","v":0},{"$f":"IF(E16+D16+C16+B16>25000,12750-(B18+C18+D18),(E16*0.51))","v":0},{"$f":"IF(F16+E16+D16+C16+B16>25000,12750-(B18+C18+D18+E18),(F16*0.51))","v":0},0]
[{"$f":"BudgetWorksheet!$A$88","v":"Subaward 6"},{"$f":"BudgetWorksheet!$D$88","v":0},{"$f":"BudgetWorksheet!$F$88","v":0},{"$f":"BudgetWorksheet!$H$88","v":0},{"$f":"BudgetWorksheet!$J$88","v":0},{"$f":"BudgetWorksheet!$L$88","v":0},0]
["Subject to OH",{"$f":"IF(B19>25000, 25000, B19)","v":0},{"$f":"IF(B19+C19>25000, 25000-B20, C19)","v":0},{"$f":"IF(B19+C19+D19>25000, 25000-(B20+C20), D19)","v":0},{"$f":"IF(B19+C19+D19+E19>25000, 25000-(B20+C20+D20), E19)","v":0},{"$f":"IF(B19+C19+D19+E19+F19>25000, 25000-(B20+C20+D20+E20), F19)","v":0},{"$f":"SUM(B20:F20)","v":0}]
{"$rows_left_out":19}
{"sheet":"Ship rates","index":3,"n_rows":10,"n_cols":2,"rows_kept":10,"cut":false,"hidden":false,"merged":[]}
["none",0]
["Western Flyer w/ Doc Ricketts",31500]
["Rachel Carson 10/12hr",12500]
["Rachel Carson 24hr",13700]
["ROV Ventana",5500]
["AUV - single vehicle",6500]
["AUV - multiple vehicles",9300]
["Mini ROV",3300]
["Test Tank",450]
[2017]