{"text_format":"1","workbook":"xlsx","n_sheets":9,"sheets":["MARS Budget w UW subaward","Sheet1","CIP MARS Node w UW subaward","MARS Budget","CIP MARS Node Upgrade","Salary Worksheet","Subaward Worksheet","Projected Ship Rates","Craig's Worksheet"],"not_rendered":{"charts":0,"images":16,"macros":1,"external_links":0,"defined_names":53,"comments":6,"pivot_tables":0},"unopened":[],"bounds":{"document_bytes":16777216,"sheet_cells":100000,"rows_first":2000,"rows_last":500,"rows_between":2000,"halvings":0,"cell_chars":16384,"cell_head_chars":4096},"cells_cut":0,"cells_raw":0,"read":"whole","date_system":"1904"}

{"sheet":"MARS Budget w UW subaward","index":0,"n_rows":117,"n_cols":13,"rows_kept":117,"cut":false,"hidden":false,"merged":[[108,0,108,1],[111,0,111,1],[114,0,114,2],[85,0,85,1],[96,0,96,1],[97,0,97,1],[98,0,98,1],[104,0,104,1],[105,0,105,1],[84,0,84,1],[40,0,40,1],[51,0,51,1],[52,0,52,1],[55,0,55,1],[56,0,56,1],[61,0,61,1],[62,0,62,1],[73,0,73,1],[74,0,74,1],[77,0,77,1],[78,0,78,1],[39,0,39,1],[2,0,2,1],[2,2,2,3],[2,4,2,5],[2,6,2,7],[8,0,8,1],[19,0,19,1],[30,0,30,1],[31,0,31,1],[38,0,38,1],[2,8,2,9],[2,10,2,11],[0,0,0,4],[1,2,1,3],[1,4,1,5],[1,6,1,7],[1,8,1,9],[1,10,1,11]]}
["MARS Renewal 2021-2026"]
[null,null,"03/01/21-02/28/22",null,"03/01/22-02/28/23",null,"03/01/23-02/28/24",null,"03/01/24-02/28/25",null,"03/01/25-02/28/26"]
["TOTAL",null,{"$f":"D117","v":930742.41449999996},null,{"$f":"F117","v":588941.62881000002},null,{"$f":"H117","v":484151.43},null,{"$f":"J117","v":779452.63719000004},null,{"$f":"L117","v":666416.62662500003},null,{"$f":"M117","v":3449704.737125}]
["SALARY/WAGES",null,2,"Y1",{"$f":"IF($C$4=1, \"HOURS\", \"MONTHS\")","v":"MONTHS"},"Y2",{"$f":"IF($C$4=1, \"HOURS\", \"MONTHS\")","v":"MONTHS"},"Y3",{"$f":"IF($C$4=1, \"HOURS\", \"MONTHS\")","v":"MONTHS"},"Y4",{"$f":"IF($C$4=1, \"HOURS\", \"MONTHS\")","v":"MONTHS"},"Y5","Total"]
[]
[{"$f":"'Salary Worksheet'!B4","v":"Mike Kelly"},null,0,{"$f":"IF($C$4=1,ROUND('Salary Worksheet'!D18*C6,2), ROUND('Salary Worksheet'!D4/12*C6,2))","v":0},0,{"$f":"IF($C$4=1,ROUND('Salary Worksheet'!E18*E6,2), ROUND('Salary Worksheet'!E4/12*E6,2))","v":0},0,{"$f":"IF($C$4=1,ROUND('Salary Worksheet'!F18*G6,2), ROUND('Salary Worksheet'!F4/12*G6,0))","v":0},0,{"$f":"IF($C$4=1,ROUND('Salary Worksheet'!G18*I6,2), ROUND('Salary Worksheet'!G4/12*I6,0))","v":0},0,{"$f":"IF($C$4=1,ROUND('Salary Worksheet'!H18*K6,2), ROUND('Salary Worksheet'!H4/12*K6,0))","v":0},{"$f":"SUM(L6,J6,H6,F6,D6)","v":0}]
[null,null,0,{"$f":"IF($C$4=1,ROUND('Salary Worksheet'!D19*C7,2), ROUND('Salary Worksheet'!D5/12*C7,2))","v":0},0,{"$f":"IF($C$4=1,ROUND('Salary Worksheet'!E19*E7,2), ROUND('Salary Worksheet'!E5/12*E7,2))","v":0},0,{"$f":"IF($C$4=1,ROUND('Salary Worksheet'!F19*G7,2), ROUND('Salary Worksheet'!F5/12*G7,0))","v":0},0,{"$f":"IF($C$4=1,ROUND('Salary Worksheet'!G19*I7,2), ROUND('Salary Worksheet'!G5/12*I7,0))","v":0},0,{"$f":"IF($C$4=1,ROUND('Salary Worksheet'!H19*K7,2), ROUND('Salary Worksheet'!H5/12*K7,0))","v":0},{"$f":"SUM(J7+H7+F7+D7+L7)","v":0}]
[null,null,0,{"$f":"IF($C$4=1,ROUND('Salary Worksheet'!D20*C8,2), ROUND('Salary Worksheet'!D6/12*C8,2))","v":0},0,{"$f":"IF($C$4=1,ROUND('Salary Worksheet'!E20*E8,2), ROUND('Salary Worksheet'!E6/12*E8,2))","v":0},0,{"$f":"IF($C$4=1,ROUND('Salary Worksheet'!F20*G8,2), ROUND('Salary Worksheet'!F6/12*G8,0))","v":0},0,{"$f":"IF($C$4=1,ROUND('Salary Worksheet'!G20*I8,2), ROUND('Salary Worksheet'!G6/12*I8,0))","v":0},0,{"$f":"IF($C$4=1,ROUND('Salary Worksheet'!H20*K8,2), ROUND('Salary Worksheet'!H6/12*K8,0))","v":0},{"$f":"SUM(J8+H8+F8+D8+L8)","v":0}]
["Subtotal Sr. Personnel Salary",null,null,{"$f":"SUM(D6:D8)","v":0},null,{"$f":"SUM(F6:F8)","v":0},null,{"$f":"SUM(H6:H8)","v":0},null,{"$f":"SUM(J6:J8)","v":0},null,{"$f":"SUM(L6:L8)","v":0},{"$f":"SUM(J9+H9+F9+D9+L9)","v":0}]
[{"$f":"'Salary Worksheet'!B7","v":"Craig Dawe"},null,5,{"$f":"IF($C$4=1,ROUND('Salary Worksheet'!D21*C10,2), ROUND('Salary Worksheet'!D7/12*C10,0))","v":79488},2,{"$f":"IF($C$4=1,ROUND('Salary Worksheet'!E21*E10,2), ROUND('Salary Worksheet'!E7/12*E10,2))","v":32748.83},0,{"$f":"IF($C$4=1,ROUND('Salary Worksheet'!F21*G10,2), ROUND('Salary Worksheet'!F7/12*G10,2))","v":0},0,{"$f":"IF($C$4=1,ROUND('Salary Worksheet'!G21*I10,2), ROUND('Salary Worksheet'!G7/12*I10,2))","v":0},0,{"$f":"IF($C$4=1,ROUND('Salary Worksheet'!H21*K10,2), ROUND('Salary Worksheet'!H7/12*K10,2))","v":0},{"$f":"SUM(L10+J10+H10+F10+D10)","v":112236.83}]
{"$rows_left_out":108}
{"sheet":"Sheet1","index":1,"n_rows":0,"n_cols":0,"rows_kept":0,"cut":false,"hidden":false,"merged":[]}

{"sheet":"CIP MARS Node w UW subaward","index":2,"n_rows":117,"n_cols":13,"rows_kept":117,"cut":false,"hidden":false,"merged":[[108,0,108,1],[111,0,111,1],[114,0,114,2],[85,0,85,1],[96,0,96,1],[97,0,97,1],[98,0,98,1],[104,0,104,1],[105,0,105,1],[84,0,84,1],[40,0,40,1],[51,0,51,1],[52,0,52,1],[55,0,55,1],[56,0,56,1],[61,0,61,1],[62,0,62,1],[73,0,73,1],[74,0,74,1],[77,0,77,1],[78,0,78,1],[39,0,39,1],[2,0,2,1],[2,2,2,3],[2,4,2,5],[2,6,2,7],[8,0,8,1],[19,0,19,1],[30,0,30,1],[31,0,31,1],[38,0,38,1],[2,8,2,9],[2,10,2,11],[0,0,0,4],[1,2,1,3],[1,4,1,5],[1,6,1,7],[1,8,1,9],[1,10,1,11]]}
["CIP: MARS Node Upgrade",null,null,null,null,null,null,null,null,null,null,"Updated:"]
[null,null,"03/01/21-02/28/22",null,"03/01/22-02/28/23",null,"03/01/23-02/28/24",null,"03/01/24-02/28/25",null,"03/01/25-02/28/26"]
["TOTAL",null,{"$f":"D117","v":190597.42300000001},null,{"$f":"F117","v":47243.155889999995},null,{"$f":"H117","v":0},null,{"$f":"J117","v":0},null,{"$f":"L117","v":0},null,{"$f":"M117","v":237840.57889}]
["SALARY/WAGES",null,2,"Y1",{"$f":"IF($C$4=1, \"HOURS\", \"MONTHS\")","v":"MONTHS"},"Y2",{"$f":"IF($C$4=1, \"HOURS\", \"MONTHS\")","v":"MONTHS"},"Y3",{"$f":"IF($C$4=1, \"HOURS\", \"MONTHS\")","v":"MONTHS"},"Y4",{"$f":"IF($C$4=1, \"HOURS\", \"MONTHS\")","v":"MONTHS"},"Y5","Total"]
[]
[{"$f":"'Salary Worksheet'!B4","v":"Mike Kelly"},null,0,{"$f":"IF($C$4=1,ROUND('Salary Worksheet'!D18*C6,2), ROUND('Salary Worksheet'!D4/12*C6,2))","v":0},0,{"$f":"IF($C$4=1,ROUND('Salary Worksheet'!E18*E6,2), ROUND('Salary Worksheet'!E4/12*E6,2))","v":0},0,{"$f":"IF($C$4=1,ROUND('Salary Worksheet'!F18*G6,2), ROUND('Salary Worksheet'!F4/12*G6,0))","v":0},0,{"$f":"IF($C$4=1,ROUND('Salary Worksheet'!G18*I6,2), ROUND('Salary Worksheet'!G4/12*I6,0))","v":0},0,{"$f":"IF($C$4=1,ROUND('Salary Worksheet'!H18*K6,2), ROUND('Salary Worksheet'!H4/12*K6,0))","v":0},{"$f":"SUM(L6,J6,H6,F6,D6)","v":0}]
[null,null,0,{"$f":"IF($C$4=1,ROUND('Salary Worksheet'!D19*C7,2), ROUND('Salary Worksheet'!D5/12*C7,2))","v":0},0,{"$f":"IF($C$4=1,ROUND('Salary Worksheet'!E19*E7,2), ROUND('Salary Worksheet'!E5/12*E7,2))","v":0},0,{"$f":"IF($C$4=1,ROUND('Salary Worksheet'!F19*G7,2), ROUND('Salary Worksheet'!F5/12*G7,0))","v":0},0,{"$f":"IF($C$4=1,ROUND('Salary Worksheet'!G19*I7,2), ROUND('Salary Worksheet'!G5/12*I7,0))","v":0},0,{"$f":"IF($C$4=1,ROUND('Salary Worksheet'!H19*K7,2), ROUND('Salary Worksheet'!H5/12*K7,0))","v":0},{"$f":"SUM(J7+H7+F7+D7+L7)","v":0}]
[null,null,0,{"$f":"IF($C$4=1,ROUND('Salary Worksheet'!D20*C8,2), ROUND('Salary Worksheet'!D6/12*C8,2))","v":0},0,{"$f":"IF($C$4=1,ROUND('Salary Worksheet'!E20*E8,2), ROUND('Salary Worksheet'!E6/12*E8,2))","v":0},0,{"$f":"IF($C$4=1,ROUND('Salary Worksheet'!F20*G8,2), ROUND('Salary Worksheet'!F6/12*G8,0))","v":0},0,{"$f":"IF($C$4=1,ROUND('Salary Worksheet'!G20*I8,2), ROUND('Salary Worksheet'!G6/12*I8,0))","v":0},0,{"$f":"IF($C$4=1,ROUND('Salary Worksheet'!H20*K8,2), ROUND('Salary Worksheet'!H6/12*K8,0))","v":0},{"$f":"SUM(J8+H8+F8+D8+L8)","v":0}]
["Subtotal Sr. Personnel Salary",null,null,{"$f":"SUM(D6:D8)","v":0},null,{"$f":"SUM(F6:F8)","v":0},null,{"$f":"SUM(H6:H8)","v":0},null,{"$f":"SUM(J6:J8)","v":0},null,{"$f":"SUM(L6:L8)","v":0},{"$f":"SUM(J9+H9+F9+D9+L9)","v":0}]
[{"$f":"'Salary Worksheet'!B7","v":"Craig Dawe"},null,2,{"$f":"IF($C$4=1,ROUND('Salary Worksheet'!D21*C10,2), ROUND('Salary Worksheet'!D7/12*C10,0))","v":31795},1,{"$f":"IF($C$4=1,ROUND('Salary Worksheet'!E21*E10,2), ROUND('Salary Worksheet'!E7/12*E10,2))","v":16374.42},0,{"$f":"IF($C$4=1,ROUND('Salary Worksheet'!F21*G10,2), ROUND('Salary Worksheet'!F7/12*G10,2))","v":0},0,{"$f":"IF($C$4=1,ROUND('Salary Worksheet'!G21*I10,2), ROUND('Salary Worksheet'!G7/12*I10,2))","v":0},0,{"$f":"IF($C$4=1,ROUND('Salary Worksheet'!H21*K10,2), ROUND('Salary Worksheet'!H7/12*K10,2))","v":0},{"$f":"SUM(L10+J10+H10+F10+D10)","v":48169.42}]
{"$rows_left_out":108}
{"sheet":"MARS Budget","index":3,"n_rows":117,"n_cols":13,"rows_kept":117,"cut":false,"hidden":false,"merged":[[108,0,108,1],[111,0,111,1],[114,0,114,2],[85,0,85,1],[96,0,96,1],[97,0,97,1],[98,0,98,1],[104,0,104,1],[105,0,105,1],[84,0,84,1],[40,0,40,1],[51,0,51,1],[52,0,52,1],[55,0,55,1],[56,0,56,1],[61,0,61,1],[62,0,62,1],[73,0,73,1],[74,0,74,1],[77,0,77,1],[78,0,78,1],[39,0,39,1],[2,0,2,1],[2,2,2,3],[2,4,2,5],[2,6,2,7],[8,0,8,1],[19,0,19,1],[30,0,30,1],[31,0,31,1],[38,0,38,1],[2,8,2,9],[2,10,2,11],[0,0,0,4],[1,2,1,3],[1,4,1,5],[1,6,1,7],[1,8,1,9],[1,10,1,11]]}
["MARS Renewal 2021-2026",null,null,null,null,null,null,null,null,null,null,"Updated:",{"$f":"TODAY()","v":"2021-06-01"}]
[null,null,"03/01/21-02/28/22",null,"03/01/22-02/28/23",null,"03/01/23-02/28/24",null,"03/01/24-02/28/25",null,"03/01/25-02/28/26"]
["TOTAL",null,{"$f":"D117","v":1067131.4145},null,{"$f":"F117","v":560200.68496500002},null,{"$f":"H117","v":507930.43},null,{"$f":"J117","v":906971.63719000004},null,{"$f":"L117","v":772369.62662500003},null,{"$f":"M117","v":3814603.7932800003}]
["SALARY/WAGES",null,2,"Y1",{"$f":"IF($C$4=1, \"HOURS\", \"MONTHS\")","v":"MONTHS"},"Y2",{"$f":"IF($C$4=1, \"HOURS\", \"MONTHS\")","v":"MONTHS"},"Y3",{"$f":"IF($C$4=1, \"HOURS\", \"MONTHS\")","v":"MONTHS"},"Y4",{"$f":"IF($C$4=1, \"HOURS\", \"MONTHS\")","v":"MONTHS"},"Y5","Total"]
[]
[{"$f":"'Salary Worksheet'!B4","v":"Mike Kelly"},null,0,{"$f":"IF($C$4=1,ROUND('Salary Worksheet'!D18*C6,2), ROUND('Salary Worksheet'!D4/12*C6,2))","v":0},0,{"$f":"IF($C$4=1,ROUND('Salary Worksheet'!E18*E6,2), ROUND('Salary Worksheet'!E4/12*E6,2))","v":0},0,{"$f":"IF($C$4=1,ROUND('Salary Worksheet'!F18*G6,2), ROUND('Salary Worksheet'!F4/12*G6,0))","v":0},0,{"$f":"IF($C$4=1,ROUND('Salary Worksheet'!G18*I6,2), ROUND('Salary Worksheet'!G4/12*I6,0))","v":0},0,{"$f":"IF($C$4=1,ROUND('Salary Worksheet'!H18*K6,2), ROUND('Salary Worksheet'!H4/12*K6,0))","v":0},{"$f":"SUM(L6,J6,H6,F6,D6)","v":0}]
[null,null,0,{"$f":"IF($C$4=1,ROUND('Salary Worksheet'!D19*C7,2), ROUND('Salary Worksheet'!D5/12*C7,2))","v":0},0,{"$f":"IF($C$4=1,ROUND('Salary Worksheet'!E19*E7,2), ROUND('Salary Worksheet'!E5/12*E7,2))","v":0},0,{"$f":"IF($C$4=1,ROUND('Salary Worksheet'!F19*G7,2), ROUND('Salary Worksheet'!F5/12*G7,0))","v":0},0,{"$f":"IF($C$4=1,ROUND('Salary Worksheet'!G19*I7,2), ROUND('Salary Worksheet'!G5/12*I7,0))","v":0},0,{"$f":"IF($C$4=1,ROUND('Salary Worksheet'!H19*K7,2), ROUND('Salary Worksheet'!H5/12*K7,0))","v":0},{"$f":"SUM(J7+H7+F7+D7+L7)","v":0}]
[null,null,0,{"$f":"IF($C$4=1,ROUND('Salary Worksheet'!D20*C8,2), ROUND('Salary Worksheet'!D6/12*C8,2))","v":0},0,{"$f":"IF($C$4=1,ROUND('Salary Worksheet'!E20*E8,2), ROUND('Salary Worksheet'!E6/12*E8,2))","v":0},0,{"$f":"IF($C$4=1,ROUND('Salary Worksheet'!F20*G8,2), ROUND('Salary Worksheet'!F6/12*G8,0))","v":0},0,{"$f":"IF($C$4=1,ROUND('Salary Worksheet'!G20*I8,2), ROUND('Salary Worksheet'!G6/12*I8,0))","v":0},0,{"$f":"IF($C$4=1,ROUND('Salary Worksheet'!H20*K8,2), ROUND('Salary Worksheet'!H6/12*K8,0))","v":0},{"$f":"SUM(J8+H8+F8+D8+L8)","v":0}]
["Subtotal Sr. Personnel Salary",null,null,{"$f":"SUM(D6:D8)","v":0},null,{"$f":"SUM(F6:F8)","v":0},null,{"$f":"SUM(H6:H8)","v":0},null,{"$f":"SUM(J6:J8)","v":0},null,{"$f":"SUM(L6:L8)","v":0},{"$f":"SUM(J9+H9+F9+D9+L9)","v":0}]
[{"$f":"'Salary Worksheet'!B7","v":"Craig Dawe"},null,5,{"$f":"IF($C$4=1,ROUND('Salary Worksheet'!D21*C10,2), ROUND('Salary Worksheet'!D7/12*C10,0))","v":79488},0,{"$f":"IF($C$4=1,ROUND('Salary Worksheet'!E21*E10,2), ROUND('Salary Worksheet'!E7/12*E10,2))","v":0},0,{"$f":"IF($C$4=1,ROUND('Salary Worksheet'!F21*G10,2), ROUND('Salary Worksheet'!F7/12*G10,2))","v":0},0,{"$f":"IF($C$4=1,ROUND('Salary Worksheet'!G21*I10,2), ROUND('Salary Worksheet'!G7/12*I10,2))","v":0},0,{"$f":"IF($C$4=1,ROUND('Salary Worksheet'!H21*K10,2), ROUND('Salary Worksheet'!H7/12*K10,2))","v":0},{"$f":"SUM(L10+J10+H10+F10+D10)","v":79488}]
{"$rows_left_out":108}
{"sheet":"CIP MARS Node Upgrade","index":4,"n_rows":117,"n_cols":13,"rows_kept":117,"cut":false,"hidden":false,"merged":[[1,4,1,5],[2,6,2,7],[2,8,2,9],[2,10,2,11],[1,6,1,7],[1,8,1,9],[1,10,1,11],[114,0,114,2],[38,0,38,1],[39,0,39,1],[30,0,30,1],[8,0,8,1],[51,0,51,1],[31,0,31,1],[55,0,55,1],[61,0,61,1],[73,0,73,1],[77,0,77,1],[84,0,84,1],[56,0,56,1],[19,0,19,1],[104,0,104,1],[108,0,108,1],[111,0,111,1],[0,0,0,4],[74,0,74,1],[40,0,40,1],[52,0,52,1],[62,0,62,1],[78,0,78,1],[85,0,85,1],[105,0,105,1],[98,0,98,1],[97,0,97,1],[2,2,2,3],[2,4,2,5],[96,0,96,1],[2,0,2,1],[1,2,1,3]]}
["CIP: MARS Node Upgrade",null,null,null,null,null,null,null,null,null,null,"Updated:",{"$f":"TODAY()","v":"2021-06-01"}]
[null,null,"03/01/21-02/28/22",null,"03/01/22-02/28/23",null,"03/01/23-02/28/24",null,"03/01/24-02/28/25",null,"03/01/25-02/28/26"]
["TOTAL",null,{"$f":"D117","v":620597.42299999995},null,{"$f":"F117","v":47243.155889999995},null,{"$f":"H117","v":0},null,{"$f":"J117","v":0},null,{"$f":"L117","v":0},null,{"$f":"M117","v":667840.57889}]
["SALARY/WAGES",null,2,"Y1",{"$f":"IF($C$4=1, \"HOURS\", \"MONTHS\")","v":"MONTHS"},"Y2",{"$f":"IF($C$4=1, \"HOURS\", \"MONTHS\")","v":"MONTHS"},"Y3",{"$f":"IF($C$4=1, \"HOURS\", \"MONTHS\")","v":"MONTHS"},"Y4",{"$f":"IF($C$4=1, \"HOURS\", \"MONTHS\")","v":"MONTHS"},"Y5","Total"]
[]
[{"$f":"'Salary Worksheet'!B4","v":"Mike Kelly"},null,0,{"$f":"IF($C$4=1,ROUND('Salary Worksheet'!D18*C6,2), ROUND('Salary Worksheet'!D4/12*C6,2))","v":0},0,{"$f":"IF($C$4=1,ROUND('Salary Worksheet'!E18*E6,2), ROUND('Salary Worksheet'!E4/12*E6,2))","v":0},0,{"$f":"IF($C$4=1,ROUND('Salary Worksheet'!F18*G6,2), ROUND('Salary Worksheet'!F4/12*G6,0))","v":0},0,{"$f":"IF($C$4=1,ROUND('Salary Worksheet'!G18*I6,2), ROUND('Salary Worksheet'!G4/12*I6,0))","v":0},0,{"$f":"IF($C$4=1,ROUND('Salary Worksheet'!H18*K6,2), ROUND('Salary Worksheet'!H4/12*K6,0))","v":0},{"$f":"SUM(L6,J6,H6,F6,D6)","v":0}]
[null,null,0,{"$f":"IF($C$4=1,ROUND('Salary Worksheet'!D19*C7,2), ROUND('Salary Worksheet'!D5/12*C7,2))","v":0},0,{"$f":"IF($C$4=1,ROUND('Salary Worksheet'!E19*E7,2), ROUND('Salary Worksheet'!E5/12*E7,2))","v":0},0,{"$f":"IF($C$4=1,ROUND('Salary Worksheet'!F19*G7,2), ROUND('Salary Worksheet'!F5/12*G7,0))","v":0},0,{"$f":"IF($C$4=1,ROUND('Salary Worksheet'!G19*I7,2), ROUND('Salary Worksheet'!G5/12*I7,0))","v":0},0,{"$f":"IF($C$4=1,ROUND('Salary Worksheet'!H19*K7,2), ROUND('Salary Worksheet'!H5/12*K7,0))","v":0},{"$f":"SUM(J7+H7+F7+D7+L7)","v":0}]
[null,null,0,{"$f":"IF($C$4=1,ROUND('Salary Worksheet'!D20*C8,2), ROUND('Salary Worksheet'!D6/12*C8,2))","v":0},0,{"$f":"IF($C$4=1,ROUND('Salary Worksheet'!E20*E8,2), ROUND('Salary Worksheet'!E6/12*E8,2))","v":0},0,{"$f":"IF($C$4=1,ROUND('Salary Worksheet'!F20*G8,2), ROUND('Salary Worksheet'!F6/12*G8,0))","v":0},0,{"$f":"IF($C$4=1,ROUND('Salary Worksheet'!G20*I8,2), ROUND('Salary Worksheet'!G6/12*I8,0))","v":0},0,{"$f":"IF($C$4=1,ROUND('Salary Worksheet'!H20*K8,2), ROUND('Salary Worksheet'!H6/12*K8,0))","v":0},{"$f":"SUM(J8+H8+F8+D8+L8)","v":0}]
["Subtotal Sr. Personnel Salary",null,null,{"$f":"SUM(D6:D8)","v":0},null,{"$f":"SUM(F6:F8)","v":0},null,{"$f":"SUM(H6:H8)","v":0},null,{"$f":"SUM(J6:J8)","v":0},null,{"$f":"SUM(L6:L8)","v":0},{"$f":"SUM(J9+H9+F9+D9+L9)","v":0}]
[{"$f":"'Salary Worksheet'!B7","v":"Craig Dawe"},null,2,{"$f":"IF($C$4=1,ROUND('Salary Worksheet'!D21*C10,2), ROUND('Salary Worksheet'!D7/12*C10,0))","v":31795},1,{"$f":"IF($C$4=1,ROUND('Salary Worksheet'!E21*E10,2), ROUND('Salary Worksheet'!E7/12*E10,2))","v":16374.42},0,{"$f":"IF($C$4=1,ROUND('Salary Worksheet'!F21*G10,2), ROUND('Salary Worksheet'!F7/12*G10,2))","v":0},0,{"$f":"IF($C$4=1,ROUND('Salary Worksheet'!G21*I10,2), ROUND('Salary Worksheet'!G7/12*I10,2))","v":0},0,{"$f":"IF($C$4=1,ROUND('Salary Worksheet'!H21*K10,2), ROUND('Salary Worksheet'!H7/12*K10,2))","v":0},{"$f":"SUM(L10+J10+H10+F10+D10)","v":48169.42}]
{"$rows_left_out":108}
{"sheet":"Salary Worksheet","index":5,"n_rows":52,"n_cols":9,"rows_kept":52,"cut":false,"hidden":false,"merged":[[33,0,33,8],[48,0,48,8],[0,0,0,8],[25,0,25,8],[31,0,31,2],[30,0,30,2],[28,1,28,2],[26,1,26,2],[1,6,1,8]]}
["SALARY WORKSHEET"]
[null,"Salary Increase Rate:",0.03,null,null,null,"CONFIDENTIAL INFORMATION"]
[null,null,"ANNUAL SALARY","YR-1","YR-2","YR-3","YR-4","YR-5"]
[null,"Mike Kelly",{"$f":"121.08*2080","v":251846.39999999999},{"$f":"ROUND(C4*($C$2+1),0)","v":259402},{"$f":"ROUND(D4*($C$2+1),0)","v":267184},{"$f":"ROUND(E4*($C$2+1),0)","v":275200},{"$f":"ROUND(F4*($C$2+1),0)","v":283456},{"$f":"ROUND(G4*($C$2+1),0)","v":291960}]
[null,"PI/Co-PI 2",0,{"$f":"ROUND(C5*($C$2+1),0)","v":0},{"$f":"ROUND(D5*(C2+1),0)","v":0},{"$f":"ROUND(E5*($C$2+1),0)","v":0},0,0]
[null,"PI/Co-PI 3",0,0,{"$f":"ROUND(D6*(C2+1),0)","v":0},0,0,0]
[null,"Craig Dawe",{"$f":"89.045*2080","v":185213.6},190770,{"$f":"ROUND(D7*($C$2+1),0)","v":196493},{"$f":"ROUND(E7*($C$2+1),0)","v":202388},{"$f":"ROUND(F7*($C$2+1),0)","v":208460},{"$f":"ROUND(G7*($C$2+1),0)","v":214714}]
[null,"MARS Operations Manager",185214,{"$f":"C8","v":185214},{"$f":"ROUND(D8*($C$2+1),0)","v":190770},196493,202388,208460]
[null,"Dave French",{"$f":"53.14*2080","v":110531.2},113847,117262,120780,124403,128135]
[null,"Paul McGill",{"$f":"91.25*2080","v":189800},195494,201359,207400,213622,220031]
{"$rows_left_out":43}
{"sheet":"Subaward Worksheet","index":6,"n_rows":38,"n_cols":7,"rows_kept":38,"cut":false,"hidden":false,"merged":[[0,0,0,6],[1,0,1,6]]}
["SUBAWARD WORKSHEET"]
["Note: This worksheet calculates subaward overhead and is populated automatically. Enter subaward amounts in the main Budget Worksheet."]
[null,"Y1","Y2","Y3","Y4","Y5","Y1-5"]
[{"$f":"'MARS Budget w UW subaward'!A96","v":"UW APL Subaward"},{"$f":"'MARS Budget w UW subaward'!D96","v":291756},{"$f":"'CIP MARS Node Upgrade'!$F$87","v":0},{"$f":"'CIP MARS Node Upgrade'!$H$87","v":0},{"$f":"'CIP MARS Node Upgrade'!$J$87","v":0},{"$f":"'CIP MARS Node Upgrade'!$L$87","v":0},{"$f":"SUM(B4:F4)","v":291756}]
["Subject to OH",{"$f":"IF(B4>25000, 25000, B4)","v":25000},{"$f":"IF(B4+C4>25000, 25000-B5, C4)","v":0},{"$f":"IF(B4+C4+D4>25000, 25000-(B5+C5), D4)","v":0},{"$f":"IF(B4+C4+D4+E4>25000, 25000-(B5+C5+D5), E4)","v":0},{"$f":"IF(B4+C4+D4+E4+F4>25000, 25000-(B5+C5+D5+E5), F4)","v":0},{"$f":"SUM(B5:F5)","v":25000}]
["OH",{"$f":"IF(B4>25000, 13125, (B4*0.51))","v":13125},{"$f":"IF(C4>25000, 13125, (C4*0.51))","v":0},{"$f":"IF(D4>25000, 13125, (D4*0.51))","v":0},{"$f":"IF(E4>25000, 13125, (E4*0.51))","v":0},{"$f":"IF(F4>25000, 13125, (F4*0.51))","v":0},13125]
[{"$f":"'CIP MARS Node Upgrade'!$A$88","v":0},{"$f":"'CIP MARS Node Upgrade'!$D$88","v":0},{"$f":"'CIP MARS Node Upgrade'!$F$88","v":0},{"$f":"'CIP MARS Node Upgrade'!$H$88","v":0},{"$f":"'CIP MARS Node Upgrade'!$J$88","v":0},{"$f":"'CIP MARS Node Upgrade'!$L$88","v":0},0]
["Subject to OH",{"$f":"IF(B7>25000, 25000, B7)","v":0},{"$f":"IF(B7+C7>25000, 25000-B8, C7)","v":0},{"$f":"IF(B7+C7+D7>25000, 25000-(B8+C8), D7)","v":0},{"$f":"IF(B7+C7+D7+E7>25000, 25000-(B8+C8+D8), E7)","v":0},{"$f":"IF(B7+C7+D7+E7+F7>25000, 25000-(B8+C8+D8+E8), F7)","v":0},{"$f":"SUM(B8:F8)","v":0}]
["OH",{"$f":"IF(B7>25000, 12750, (B7*0.51))","v":0},{"$f":"IF(C7+B7>25000,12750-B9,ROUND(C7*0.51,0))","v":0},{"$f":"IF(D7+C7+B7>25000,12750-(B9+C9),(D7*0.51))","v":0},{"$f":"IF(E7+D7+C7+B7>25000,12750-(B9+C9+D9),(E7*0.51))","v":0},{"$f":"IF(F7+E7+D7+C7+B7>25000,12750-(B9+C9+D9+E9),(F7*0.51))","v":0},0]
[{"$f":"'CIP MARS Node Upgrade'!$A$89","v":0},{"$f":"'CIP MARS Node Upgrade'!$D$89","v":0},{"$f":"'CIP MARS Node Upgrade'!$F$89","v":0},{"$f":"'CIP MARS Node Upgrade'!$H$89","v":0},{"$f":"'CIP MARS Node Upgrade'!$J$89","v":0},{"$f":"'CIP MARS Node Upgrade'!$L$89","v":0},0]
{"$rows_left_out":29}
{"sheet":"Projected Ship Rates","index":7,"n_rows":16,"n_cols":7,"rows_kept":16,"cut":false,"hidden":false,"merged":[]}
["Asset",2020,2021,2022,2023,2024,2025]
["Rachel Carson",13385,13885,14405,15180,15750,16350]
["Rachel Carson 12",14660,15200,15780,16600,17200,17890]
["Ventana",6400,6600,6900,7100,7300,7600]
["Western Flyer with Ricketts",33000,33990,35009.700000000004,"N/A","N/A","N/A"]
["AUV",12745,13100,13500,13900,14300,14775]
["Paragon",500,515,530,545,560,580]
[]
[]
[]
{"$rows_left_out":7}
{"sheet":"Craig's Worksheet","index":8,"n_rows":85,"n_cols":22,"rows_kept":85,"cut":false,"hidden":false,"merged":[]}
[null,null,null,null,null,"MARS O&M Operational Costs Mar 1 2021 - February 28 2026"]
[]
["Item",null,null,null,"Yr 1",null,"Yr 2",null,"Yr 3",null,"Yr 4",null,"Yr 5",null,"Item"]
[null,null,null,null,"months","cost","months","cost","months","cost","months","cost","months","cost"]
["Personnel",null,null,null,null,null,null,null,null,null,null,null,null,null,"Personnel"]
[null,"Kelly",null,null,2,0,2,0,2,{"$f":"I6*4.5*80*R6","v":0},2,0,2,0]
[null,"Dawe",null,null,5,{"$f":"E7*4.5*40*R7","v":80136},4,{"$f":"G7*4.5*40*S7","v":66032.063999999998},4,{"$f":"I7*4.5*40*T7","v":68013.02592},4,{"$f":"K7*4.5*40*U7","v":70053.416697599998},4,{"$f":"M7*4.5*40*V7","v":72155.019198527996},null,"Dawe",null,89.04,{"$f":"R7+R7*0.03","v":91.711200000000005},94.462536,97.296412079999996,100.2153044424]
[null,"Thompson",null,null,2.33,27596.519999999997,3,36597.96,4,{"$f":"I8*4.5*40*T8","v":50261.198400000001},4,{"$f":"K8*4.5*40*U8","v":51769.034351999995},4,{"$f":"M8*4.5*40*V8","v":53322.105382560003},null,"Thompson",null,65.8,67.774000000000001,69.807220000000001,71.901436599999997,74.058479697999999]
[null,"French",null,null,1,12600,0.66700000000000004,8656.3259999999991,2,{"$f":"I9*4.5*40*T9","v":26734.679999999997},2,{"$f":"K9*4.5*40*U9","v":27536.720399999998},2,{"$f":"M9*4.5*40*V9","v":28362.822011999997},null,"French",null,70,72.099999999999994,74.262999999999991,76.490889999999993,78.785616699999991]
[null,"McGill/Mellinger",null,null,0.5,8377.2000000000007,null,0,null,null,null,null,null,null,null,"McGill/Mellinger",null,93.08,95.872399999999999,98.748571999999996,101.71102916,104.7623600348]
{"$rows_left_out":75}